Target
Leukotriene B4 receptor 1
Ligand
BDBM50042166
Substrate
Meas. Tech.
ChEBML_153299
Ki
147±n/a nM
Citation
 Daines, RAChambers, PAPendrak, IJakas, DRSarau, HMFoley, JJSchmidt, DBKingsbury, WD Trisubstituted pyridine leukotriene B4 receptor antagonists: synthesis and structure-activity relationships. J Med Chem 36:3321-32 (1993)  
Target
Name:
Leukotriene B4 receptor 1
Synonyms:
BLT BLTR Chemoattractant receptor-like 1 GPR16 LTB4-R 1 Leukotriene B4 R1 Leukotriene B4 receptor 1 P2Y purinoceptor 7 | P2Y7
Type:
Enzyme Catalytic Domain
Mol. Mass.:
37582.68
Organism:
Homo sapiens (Human)
Description:
Q15722
Residue:
352
  
Inhibitor
Name:
BDBM50042166
Synonyms:
3-{6-(3-Benzenesulfonylamino-benzenesulfinylmethyl)-3-[8-(4-methoxy-phenyl)-octyloxy]-pyridin-2-yl}-acrylic acid | CHEMBL321261
Type:
Small organic molecule
Emp. Form.:
C36H40N2O7S2
Mol. Mass.:
676.842
SMILES:
COc1ccc(CCCCCCCCOc2ccc(CS(=O)c3cccc(NS(=O)(=O)c4ccccc4)c3)nc2C=CC(O)=O)cc1
: