Target
Leukotriene B4 receptor 1
Ligand
BDBM50042186
Substrate
Meas. Tech.
ChEBML_99828
Ki
27000±n/a nM
Citation
 Boehm, JCGleason, JGPendrak, ISarau, HMSchmidt, DBFoley, JJKingsbury, WD Synthesis and LTB4 receptor antagonist activities of the naturally occurring LTB4 receptor antagonist Leucettamine A and related analogues. J Med Chem 36:3333-40 (1993)  
Target
Name:
Leukotriene B4 receptor 1
Synonyms:
BLT BLTR Chemoattractant receptor-like 1 GPR16 LTB4-R 1 Leukotriene B4 R1 Leukotriene B4 receptor 1 P2Y purinoceptor 7 | P2Y7
Type:
Enzyme Catalytic Domain
Mol. Mass.:
37582.68
Organism:
Homo sapiens (Human)
Description:
Q15722
Residue:
352
  
Inhibitor
Name:
BDBM50042186
Synonyms:
5-Benzyl-4-(3-methoxy-benzyl)-1-methyl-1H-imidazol-2-ylamine | CHEMBL115679
Type:
Small organic molecule
Emp. Form.:
C19H21N3O
Mol. Mass.:
307.3895
SMILES:
COc1cccc(Cc2nc(N)n(C)c2Cc2ccccc2)c1
: