Target
Type-1 angiotensin II receptor B
Ligand
BDBM50042252
Substrate
Meas. Tech.
ChEBML_34806
IC50
10000±n/a nM
Citation
 Bernhart, CAPerreaut, PMFerrari, BPMuneaux, YAAssens, JLClément, JHaudricourt, FMuneaux, CFTaillades, JEVignal, MA A new series of imidazolones: highly specific and potent nonpeptide AT1 angiotensin II receptor antagonists. J Med Chem 36:3371-80 (1993)  
Target
Name:
Type-1 angiotensin II receptor B
Synonyms:
AGTRB_RAT Agtr1 Angiotensin II AT1B Angiotensin II type 1b (AT-1b) receptor Type-1B angiotensin II receptor
Type:
Enzyme Catalytic Domain
Mol. Mass.:
40929.44
Organism:
RAT
Description:
Angiotensin II AT1B 0 RAT::P29089
Residue:
359
  
Inhibitor
Name:
BDBM50042252
Synonyms:
4'-(2-Heptafluoropropyl-4-oxo-1,3-diaza-spiro[4.4]non-1-en-3-ylmethyl)-biphenyl-2-carboxylic acid | CHEMBL114625
Type:
Small organic molecule
Emp. Form.:
C24H19F7N2O3
Mol. Mass.:
516.4081
SMILES:
OC(=O)c1ccccc1-c1ccc(CN2C(=O)C3(CCCC3)N=C2C(F)(F)C(F)(F)C(F)(F)F)cc1
: