Target
Type-1 angiotensin II receptor B
Ligand
BDBM50042262
Substrate
Meas. Tech.
ChEBML_34806
IC50
480±n/a nM
Citation
 Bernhart, CAPerreaut, PMFerrari, BPMuneaux, YAAssens, JLClément, JHaudricourt, FMuneaux, CFTaillades, JEVignal, MA A new series of imidazolones: highly specific and potent nonpeptide AT1 angiotensin II receptor antagonists. J Med Chem 36:3371-80 (1993)  
Target
Name:
Type-1 angiotensin II receptor B
Synonyms:
AGTRB_RAT Agtr1 Angiotensin II AT1B Angiotensin II type 1b (AT-1b) receptor Type-1B angiotensin II receptor
Type:
Enzyme Catalytic Domain
Mol. Mass.:
40929.44
Organism:
RAT
Description:
Angiotensin II AT1B 0 RAT::P29089
Residue:
359
  
Inhibitor
Name:
BDBM50042262
Synonyms:
4'-[2-Butyl-8-(2-carboxy-benzoyl)-4-oxo-1,3,8-triaza-spiro[4.5]dec-1-en-3-ylmethyl]-biphenyl-2-carboxylic acid | CHEMBL325905
Type:
Small organic molecule
Emp. Form.:
C33H33N3O6
Mol. Mass.:
567.6316
SMILES:
CCCCC1=NC2(CCN(CC2)C(=O)c2ccccc2C(O)=O)C(=O)N1Cc1ccc(cc1)-c1ccccc1C(O)=O
: