Target
Purine nucleoside phosphorylase
Ligand
BDBM50042366
Substrate
Meas. Tech.
ChEBML_153331
Ki
600±n/a nM
Citation
 Kelley, JLLinn, JAMcLean, EWTuttle, JV 9-[(Phosphonoalkyl)benzyl]guanines. Multisubstrate analogue inhibitors of human erythrocyte purine nucleoside phosphorylase. J Med Chem 36:3455-63 (1993)  
Target
Name:
Purine nucleoside phosphorylase
Synonyms:
Inosine phosphorylase NP PNPH_HUMAN | Purine nucleoside phosphorylase (PNPase)
Type:
Enzyme
Mol. Mass.:
32119.53
Organism:
Homo sapiens (Human)
Description:
Residue:
289
  
Inhibitor
Name:
BDBM50042366
Synonyms:
CHEMBL116580 | [3-(2-Amino-6-oxo-1,6-dihydro-purin-9-ylmethyl)-phenoxymethyl]-phosphonic acid
Type:
Small organic molecule
Emp. Form.:
C13H14N5O5P
Mol. Mass.:
351.2545
SMILES:
Nc1nc2n(Cc3cccc(OCP(O)(O)=O)c3)cnc2c(=O)[nH]1
: