Target
Cathepsin B
Ligand
BDBM50042393
Substrate
Meas. Tech.
ChEBML_47386
pH
5.2±n/a
Ki
3000±n/a nM
Comments
extracted
Citation
 Li, ZPatil, GSGolubski, ZEHori, HTehrani, KForeman, JEEveleth, DDBartus, RTPowers, JC Peptide alpha-keto ester, alpha-keto amide, and alpha-keto acid inhibitors of calpains and other cysteine proteases. J Med Chem 36:3472-80 (1993)  
Target
Name:
Cathepsin B
Synonyms:
BCSB CTSB Cathepsin B1
Type:
Enzyme
Mol. Mass.:
36657.87
Organism:
Bos taurus (bovine)
Description:
Bovine spleen CB was purchased from Sigma Co. (USA).
Residue:
335
  
Inhibitor
Name:
BDBM50042393
Synonyms:
CHEMBL432443 | [1-(1-Benzyl-2-butylcarbamoyl-2-oxo-ethylcarbamoyl)-3-methyl-butyl]-carbamic acid benzyl ester
Type:
Small organic molecule
Emp. Form.:
C28H37N3O5
Mol. Mass.:
495.6105
SMILES:
CCCCNC(=O)C(=O)C(Cc1ccccc1)NC(=O)C(CC(C)C)NC(=O)OCc1ccccc1
: