Target
Transmembrane prolyl 4-hydroxylase
Ligand
BDBM50042876
Substrate
Meas. Tech.
ChEMBL_223465 (CHEMBL844877)
IC50
190±n/a nM
Citation
 Hales, NJBeattie, JF Novel inhibitors of prolyl 4-hydroxylase. 5. The intriguing structure-activity relationships seen with 2,2'-bipyridine and its 5,5'-dicarboxylic acid derivatives. J Med Chem 36:3853-8 (1994)  
Target
Name:
Transmembrane prolyl 4-hydroxylase
Synonyms:
Hypoxia-inducible factor prolyl 4-hydroxylase Hypoxia-inducible factor prolyl hydroxylase 4 P4HTM PH4 | Transmembrane prolyl 4-hydroxylase
Type:
Enzyme
Mol. Mass.:
56654.25
Organism:
Homo sapiens (Human)
Description:
Q9NXG6
Residue:
502
  
Inhibitor
Name:
BDBM50042876
Synonyms:
CHEMBL332005 | [2,2']Bipyridinyl-5,5'-dicarboxylic acid
Type:
Small organic molecule
Emp. Form.:
C12H8N2O4
Mol. Mass.:
244.2029
SMILES:
OC(=O)c1ccc(nc1)-c1ccc(cn1)C(O)=O
: