Target
Polyunsaturated fatty acid 5-lipoxygenase
Ligand
BDBM50042959
Substrate
Meas. Tech.
ChEBML_3921
IC50
17±n/a nM
Citation
 Sogawa, SNihro, YUeda, HIzumi, AMiki, TMatsumoto, HSatoh, T 3,4-Dihydroxychalcones as potent 5-lipoxygenase and cyclooxygenase inhibitors. J Med Chem 36:3904-9 (1994)  
Target
Name:
Polyunsaturated fatty acid 5-lipoxygenase
Synonyms:
Alox5 LOX5_RAT
Type:
PROTEIN
Mol. Mass.:
78082.31
Organism:
Rattus norvegicus
Description:
ChEMBL_1432947
Residue:
673
  
Inhibitor
Name:
BDBM50042959
Synonyms:
3-(3,4-Dihydroxy-phenyl)-1-(2,4-dimethyl-phenyl)-propenone | CHEMBL126499
Type:
Small organic molecule
Emp. Form.:
C17H16O3
Mol. Mass.:
268.3071
SMILES:
Cc1ccc(C(=O)C=Cc2ccc(O)c(O)c2)c(C)c1
: