Target
Leukotriene B4 receptor 1/2
Ligand
BDBM50029477
Substrate
Meas. Tech.
ChEMBL_144780 (CHEMBL751445)
IC50
3.4±n/a nM
Citation
 Sawyer, JSBaldwin, RFSofia, MJFloreancig, PMarder, PSaussy, DLFroelich, LLSilbaugh, SAStengel, PWCockerham, SL Biphenylyl-substituted xanthones: highly potent leukotriene B4 receptor antagonists. J Med Chem 36:3982-4 (1994)  
Target
Name:
Leukotriene B4 receptor 1/2
Synonyms:
Leukotriene B4 receptor
Type:
Mol. Mass.:
Description:
ASSAY_ID of ChEMBL is 88360
Components:
This complex has 2 components.
Component 1
Name:
Leukotriene B4 receptor 2
Synonyms:
BLT2R LT4R2_HUMAN LTB4-R 2 LTB4R2 Leukotriene B4 Leukotriene B4 receptor Leukotriene B4 receptor BLT2 Seven transmembrane receptor BLTR2
Type:
Enzyme Catalytic Domain
Mol. Mass.:
37964.86
Organism:
Homo sapiens (Human)
Description:
Leukotriene 2 0 HUMAN::Q9NPC1
Residue:
358
  
Component 2
Name:
Leukotriene B4 receptor 1
Synonyms:
BLT BLTR Chemoattractant receptor-like 1 GPR16 LTB4-R 1 Leukotriene B4 R1 Leukotriene B4 receptor 1 P2Y purinoceptor 7 | P2Y7
Type:
Enzyme Catalytic Domain
Mol. Mass.:
37582.68
Organism:
Homo sapiens (Human)
Description:
Q15722
Residue:
352
  
Inhibitor
Name:
BDBM50029477
Synonyms:
5-(2-Carboxy-ethyl)-6-[3-(5-ethyl-2-hydroxy-biphenyl-4-yloxy)-propoxy]-9-oxo-9H-xanthene-2-carboxylic acid | CHEMBL340460
Type:
Small organic molecule
Emp. Form.:
C34H30O9
Mol. Mass.:
582.5966
SMILES:
CCc1cc(c(O)cc1OCCCOc1ccc2c(oc3ccc(cc3c2=O)C(O)=O)c1CCC(O)=O)-c1ccccc1
: