Target
Type-2 angiotensin II receptor
Ligand
BDBM50043029
Substrate
Meas. Tech.
ChEBML_35286
IC50
300±n/a nM
Citation
 VanAtten, MKEnsinger, CLChiu, ATMcCall, DENguyen, TTWexler, RRTimmermans, PB A novel series of selective, non-peptide inhibitors of angiotensin II binding to the AT2 site. J Med Chem 36:3985-92 (1994)  
Target
Name:
Type-2 angiotensin II receptor
Synonyms:
AGTR2_RAT Agtr2 Angiotensin II receptor Type-2 angiotensin II receptor
Type:
Enzyme Catalytic Domain
Mol. Mass.:
41346.62
Organism:
RAT
Description:
Angiotensin II AT2 0 0::P35351
Residue:
363
  
Inhibitor
Name:
BDBM50043029
Synonyms:
2-(Methyl-phenyl-carbamoyl)-6-phenoxy-1,2,3,4-tetrahydro-isoquinoline-3-carboxylic acid | CHEMBL128594
Type:
Small organic molecule
Emp. Form.:
C24H22N2O4
Mol. Mass.:
402.4425
SMILES:
CN(C(=O)N1Cc2ccc(Oc3ccccc3)cc2CC1C(O)=O)c1ccccc1
: