Target
5-lipoxygenase
Ligand
BDBM50043346
Substrate
Meas. Tech.
ChEMBL_3983 (CHEMBL619256)
IC50
4000±n/a nM
Citation
 Müller, KGürster, DPiwek, SWiegrebe, W Antipsoriatic anthrones with modulated redox properties. 1. Novel 10-substituted 1,8-dihydroxy-9(10H)-anthracenones as inhibitors of 5-lipoxygenase. J Med Chem 36:4099-107 (1994)  
Target
Name:
5-lipoxygenase
Synonyms:
Arachidonate 5-lipoxygenase
Type:
PROTEIN
Mol. Mass.:
49994.23
Organism:
Bos taurus
Description:
ChEMBL_157766
Residue:
430
  
Inhibitor
Name:
BDBM50043346
Synonyms:
1,8-Dihydroxy-10-(4-hydroxy-benzylidene)-10H-anthracen-9-one CHEMBL131667
Type:
Small organic molecule
Emp. Form.:
C21H14O4
Mol. Mass.:
330.3335
SMILES:
[#8]-c1ccc(\[#6]=[#6]-2/c3cccc(-[#8])c3-[#6](=O)-c3c(-[#8])cccc-23)cc1
: