Target
5-lipoxygenase
Ligand
BDBM50043357
Substrate
Meas. Tech.
ChEMBL_51443 (CHEMBL664363)
IC50
2000±n/a nM
Citation
 Müller, KGürster, DPiwek, SWiegrebe, W Antipsoriatic anthrones with modulated redox properties. 1. Novel 10-substituted 1,8-dihydroxy-9(10H)-anthracenones as inhibitors of 5-lipoxygenase. J Med Chem 36:4099-107 (1994)  
Target
Name:
5-lipoxygenase
Synonyms:
Arachidonate 5-lipoxygenase
Type:
PROTEIN
Mol. Mass.:
49994.23
Organism:
Bos taurus
Description:
ChEMBL_157766
Residue:
430
  
Inhibitor
Name:
BDBM50043357
Synonyms:
1,8-Dihydroxy-10-(3-phenyl-propionyl)-10H-anthracen-9-one | CHEMBL130302
Type:
Small organic molecule
Emp. Form.:
C23H18O4
Mol. Mass.:
358.3866
SMILES:
Oc1cccc2C(C(=O)CCc3ccccc3)c3cccc(O)c3C(=O)c12
: