Target
5-lipoxygenase
Ligand
BDBM50043348
Substrate
Meas. Tech.
ChEMBL_51443 (CHEMBL664363)
IC50
14000±n/a nM
Citation
 Müller, KGürster, DPiwek, SWiegrebe, W Antipsoriatic anthrones with modulated redox properties. 1. Novel 10-substituted 1,8-dihydroxy-9(10H)-anthracenones as inhibitors of 5-lipoxygenase. J Med Chem 36:4099-107 (1994)  
Target
Name:
5-lipoxygenase
Synonyms:
Arachidonate 5-lipoxygenase
Type:
PROTEIN
Mol. Mass.:
49994.23
Organism:
Bos taurus
Description:
ChEMBL_157766
Residue:
430
  
Inhibitor
Name:
BDBM50043348
Synonyms:
1,8-Dihydroxy-10-(4-nitro-benzylidene)-10H-anthracen-9-one CHEMBL337845
Type:
Small organic molecule
Emp. Form.:
C21H13NO5
Mol. Mass.:
359.3316
SMILES:
[#8]-c1cccc2\[#6](=[#6]\c3ccc(cc3)-[#7+](-[#8-])=O)-c3cccc(-[#8])c3-[#6](=O)-c12
: