Target
5-lipoxygenase
Ligand
BDBM50043367
Substrate
Meas. Tech.
ChEMBL_51443 (CHEMBL664363)
IC50
2000±n/a nM
Citation
 Müller, KGürster, DPiwek, SWiegrebe, W Antipsoriatic anthrones with modulated redox properties. 1. Novel 10-substituted 1,8-dihydroxy-9(10H)-anthracenones as inhibitors of 5-lipoxygenase. J Med Chem 36:4099-107 (1994)  
Target
Name:
5-lipoxygenase
Synonyms:
Arachidonate 5-lipoxygenase
Type:
PROTEIN
Mol. Mass.:
49994.23
Organism:
Bos taurus
Description:
ChEMBL_157766
Residue:
430
  
Inhibitor
Name:
BDBM50043367
Synonyms:
10-[2-(3,5-Di-tert-butyl-4-hydroxy-phenyl)-acetyl]-1,8-dihydroxy-10H-anthracen-9-one | CHEMBL130209
Type:
Small organic molecule
Emp. Form.:
C30H32O5
Mol. Mass.:
472.5721
SMILES:
CC(C)(C)c1cc(CC(=O)C2c3cccc(O)c3C(=O)c3c(O)cccc23)cc(c1O)C(C)(C)C
: