Target
5-lipoxygenase
Ligand
BDBM50041802
Substrate
Meas. Tech.
ChEMBL_3983 (CHEMBL619256)
IC50
37000±n/a nM
Citation
 Müller, KGürster, DPiwek, SWiegrebe, W Antipsoriatic anthrones with modulated redox properties. 1. Novel 10-substituted 1,8-dihydroxy-9(10H)-anthracenones as inhibitors of 5-lipoxygenase. J Med Chem 36:4099-107 (1994)  
Target
Name:
5-lipoxygenase
Synonyms:
Arachidonate 5-lipoxygenase
Type:
PROTEIN
Mol. Mass.:
49994.23
Organism:
Bos taurus
Description:
ChEMBL_157766
Residue:
430
  
Inhibitor
Name:
BDBM50041802
Synonyms:
1,8-dihydroxy-9(10H)-anthracenone 1,8-dihydroxyanthracen-9(10H)-one CHEMBL46469 anthralin dithranol
Type:
Small organic molecule
Emp. Form.:
C14H10O3
Mol. Mass.:
226.2274
SMILES:
Oc1cccc2Cc3cccc(O)c3C(=O)c12
: