Target
Dihydrofolate reductase
Ligand
BDBM50043400
Substrate
Meas. Tech.
ChEMBL_54605 (CHEMBL667327)
Ki
0.00508±n/a nM
Citation
 Piper, JRJohnson, CAMaddry, JAMalik, NDMcGuire, JJOtter, GMSirotnak, FM Studies on analogues of classical antifolates bearing the naphthoyl group in place of benzoyl in the side chain. J Med Chem 36:4161-71 (1994)  
Target
Name:
Dihydrofolate reductase
Synonyms:
DYR_MOUSE | Dhfr
Type:
Enzyme
Mol. Mass.:
21608.82
Organism:
Mus musculus (Mouse)
Description:
Residue:
187
  
Inhibitor
Name:
BDBM50043400
Synonyms:
2-({4-[(2,4-Diamino-5-methyl-pyrido[2,3-d]pyrimidin-6-ylmethyl)-amino]-naphthalene-1-carbonyl}-amino)-pentanedioic acid | CHEMBL341401
Type:
Small organic molecule
Emp. Form.:
C25H25N7O5
Mol. Mass.:
503.5099
SMILES:
Cc1c(CNc2ccc(C(=O)NC(CCC(O)=O)C(O)=O)c3ccccc23)cnc2nc(N)nc(N)c12
: