Target
Dihydrofolate reductase
Ligand
BDBM50016325
Substrate
Meas. Tech.
ChEMBL_54962 (CHEMBL666693)
IC50
0.0016±n/a nM
Citation
 Piper, JRJohnson, CAMaddry, JAMalik, NDMcGuire, JJOtter, GMSirotnak, FM Studies on analogues of classical antifolates bearing the naphthoyl group in place of benzoyl in the side chain. J Med Chem 36:4161-71 (1994)  
Target
Name:
Dihydrofolate reductase
Synonyms:
DYR_RAT Dihydrofolate reductase (DHFR) Tetrahydrofolate dehydrogenase
Type:
Enzyme
Mol. Mass.:
21638.84
Organism:
Rattus norvegicus (rat)
Description:
Residue:
187
  
Inhibitor
Name:
BDBM50016325
Synonyms:
2-{4-[(2,4-Diamino-pyrido[2,3-d]pyrimidin-6-ylmethyl)-amino]-benzoylamino}-pentanedioic acid | CHEMBL275309
Type:
Small organic molecule
Emp. Form.:
C20H21N7O5
Mol. Mass.:
439.4246
SMILES:
Nc1nc(N)c2cc(CNc3ccc(cc3)C(=O)NC(CCC(O)=O)C(O)=O)cnc2n1
: