Target
72 kDa type IV collagenase
Ligand
BDBM50043582
Substrate
Meas. Tech.
ChEMBL_71653 (CHEMBL687543)
Ki
410±n/a nM
Citation
 Chapman, KTKopka, IEDurette, PLEsser, CKLanza, TJIzquierdo-Martin, MNiedzwiecki, LChang, BHarrison, RKKuo, DW Inhibition of matrix metalloproteinases by N-carboxyalkyl peptides. J Med Chem 36:4293-301 (1994)  
Target
Name:
72 kDa type IV collagenase
Synonyms:
72 kDa gelatinase CLG4A Gelatinase A (MMP-2) MMP2_HUMAN Matrix metalloproteinase-2 (MMP 2) Matrix metalloproteinases 2 (MMP-2) | TBE-1
Type:
Enzyme
Mol. Mass.:
73870.36
Organism:
Homo sapiens (Human)
Description:
P08253
Residue:
660
  
Inhibitor
Name:
BDBM50043582
Synonyms:
1N-phenyl-2-[1-[1-amino-(1R)-ethylcarboxamido]-3-phenyl-(1S)-propylcarboxamido]-4-methyl-(2S)-pentanamide | CHEMBL422266
Type:
Small organic molecule
Emp. Form.:
C25H34N4O3
Mol. Mass.:
438.5625
SMILES:
CC(C)C[C@H](NC(=O)[C@H](CCc1ccccc1)NC(=O)[C@@H](C)N)C(=O)Nc1ccccc1
: