Target
Interstitial collagenase
Ligand
BDBM50043584
Substrate
Meas. Tech.
ChEMBL_49514 (CHEMBL660238)
Ki
1200±n/a nM
Citation
 Chapman, KTKopka, IEDurette, PLEsser, CKLanza, TJIzquierdo-Martin, MNiedzwiecki, LChang, BHarrison, RKKuo, DW Inhibition of matrix metalloproteinases by N-carboxyalkyl peptides. J Med Chem 36:4293-301 (1994)  
Target
Name:
Interstitial collagenase
Synonyms:
CLG MMP1 Matrix metalloproteinase-1 | Matrix metalloproteinase-1 (MMP-1)
Type:
Enzyme
Mol. Mass.:
54010.26
Organism:
Homo sapiens (Human)
Description:
P03956
Residue:
469
  
Inhibitor
Name:
BDBM50043584
Synonyms:
1N-(4-methoxyphenyl)-2-[1-[1-amino-(1R)-ethylcarboxamido]-3-phenyl-(1S)-propylcarboxamido]-4-methyl-(2S)-pentanamide | CHEMBL135448
Type:
Small organic molecule
Emp. Form.:
C26H36N4O4
Mol. Mass.:
468.5884
SMILES:
COc1ccc(NC(=O)[C@H](CC(C)C)NC(=O)[C@H](CCc2ccccc2)NC(=O)[C@@H](C)N)cc1
: