Target
Interstitial collagenase
Ligand
BDBM50043587
Substrate
Meas. Tech.
ChEMBL_49504 (CHEMBL662799)
IC50
2000±n/a nM
Citation
 Chapman, KTKopka, IEDurette, PLEsser, CKLanza, TJIzquierdo-Martin, MNiedzwiecki, LChang, BHarrison, RKKuo, DW Inhibition of matrix metalloproteinases by N-carboxyalkyl peptides. J Med Chem 36:4293-301 (1994)  
Target
Name:
Interstitial collagenase
Synonyms:
CLG MMP1 Matrix metalloproteinase-1 | Matrix metalloproteinase-1 (MMP-1)
Type:
Enzyme
Mol. Mass.:
54010.26
Organism:
Homo sapiens (Human)
Description:
P03956
Residue:
469
  
Inhibitor
Name:
BDBM50043587
Synonyms:
1N-[1-benzylcarbamoyl-2-phenyl-(1S)-ethyl]-2-[1-amino-2-methyl-(1R)-propylcarboxamido]-4-methyl-(2S)-pentanamide | CHEMBL132762
Type:
Small organic molecule
Emp. Form.:
C27H38N4O3
Mol. Mass.:
466.6156
SMILES:
CC(C)C[C@H](NC(=O)[C@H](N)C(C)C)C(=O)N[C@@H](Cc1ccccc1)C(=O)NCc1ccccc1
: