Target
Stromelysin-1
Ligand
BDBM50043595
Substrate
Meas. Tech.
ChEMBL_205501 (CHEMBL810393)
IC50
>100000±n/a nM
Citation
 Chapman, KTKopka, IEDurette, PLEsser, CKLanza, TJIzquierdo-Martin, MNiedzwiecki, LChang, BHarrison, RKKuo, DW Inhibition of matrix metalloproteinases by N-carboxyalkyl peptides. J Med Chem 36:4293-301 (1994)  
Target
Name:
Stromelysin-1
Synonyms:
MMP-3 MMP3_HUMAN Matrix metalloproteinase 3 Matrix metalloproteinase-3 (MMP-3) SL-1 Stromelysin 1 | Transin-1
Type:
Enzyme
Mol. Mass.:
53973.13
Organism:
Homo sapiens (Human)
Description:
P08254
Residue:
477
  
Inhibitor
Name:
BDBM50043595
Synonyms:
1N-phenyl-2-[1-[1-amino-(1R)-ethylcarboxamido]-2-phenyl-(1S)-ethylcarboxamido]-4-methyl-(2S)-pentanamide | CHEMBL434624
Type:
Small organic molecule
Emp. Form.:
C24H32N4O3
Mol. Mass.:
424.5359
SMILES:
CC(C)C[C@H](NC(=O)[C@H](Cc1ccccc1)NC(=O)[C@@H](C)N)C(=O)Nc1ccccc1
: