Target
Interstitial collagenase
Ligand
BDBM50043591
Substrate
Meas. Tech.
ChEMBL_49514 (CHEMBL660238)
Ki
1000±n/a nM
Citation
 Chapman, KTKopka, IEDurette, PLEsser, CKLanza, TJIzquierdo-Martin, MNiedzwiecki, LChang, BHarrison, RKKuo, DW Inhibition of matrix metalloproteinases by N-carboxyalkyl peptides. J Med Chem 36:4293-301 (1994)  
Target
Name:
Interstitial collagenase
Synonyms:
CLG MMP1 Matrix metalloproteinase-1 | Matrix metalloproteinase-1 (MMP-1)
Type:
Enzyme
Mol. Mass.:
54010.26
Organism:
Homo sapiens (Human)
Description:
P03956
Residue:
469
  
Inhibitor
Name:
BDBM50043591
Synonyms:
1N-phenyl-11-amino-2-[1-[1-amino-(1R)-ethylcarboxamido]-3-phenyl-(1S)-propylcarboxamido]undecanamide | CHEMBL343378
Type:
Small organic molecule
Emp. Form.:
C30H45N5O3
Mol. Mass.:
523.71
SMILES:
C[C@@H](N)C(=O)N[C@@H](CCc1ccccc1)C(=O)NC(CCCCCCCCCN)C(=O)Nc1ccccc1
: