Target
Interstitial collagenase
Ligand
BDBM50043595
Substrate
Meas. Tech.
ChEMBL_49504 (CHEMBL662799)
IC50
52100±n/a nM
Citation
 Chapman, KTKopka, IEDurette, PLEsser, CKLanza, TJIzquierdo-Martin, MNiedzwiecki, LChang, BHarrison, RKKuo, DW Inhibition of matrix metalloproteinases by N-carboxyalkyl peptides. J Med Chem 36:4293-301 (1994)  
Target
Name:
Interstitial collagenase
Synonyms:
CLG MMP1 Matrix metalloproteinase-1 | Matrix metalloproteinase-1 (MMP-1)
Type:
Enzyme
Mol. Mass.:
54010.26
Organism:
Homo sapiens (Human)
Description:
P03956
Residue:
469
  
Inhibitor
Name:
BDBM50043595
Synonyms:
1N-phenyl-2-[1-[1-amino-(1R)-ethylcarboxamido]-2-phenyl-(1S)-ethylcarboxamido]-4-methyl-(2S)-pentanamide | CHEMBL434624
Type:
Small organic molecule
Emp. Form.:
C24H32N4O3
Mol. Mass.:
424.5359
SMILES:
CC(C)C[C@H](NC(=O)[C@H](Cc1ccccc1)NC(=O)[C@@H](C)N)C(=O)Nc1ccccc1
: