Target
Glutathione S-transferase Mu 1
Ligand
BDBM50043760
Substrate
Meas. Tech.
ChEMBL_72447 (CHEMBL682617)
Ki
15100±n/a nM
Citation
 Lyttle, MHHocker, MDHui, HCCaldwell, CGAaron, DTEngqvist-Goldstein, AFlatgaard, JEBauer, KE Isozyme-specific glutathione-S-transferase inhibitors: design and synthesis. J Med Chem 37:189-94 (1994)  
Target
Name:
Glutathione S-transferase Mu 1
Synonyms:
GST class-mu 1 GSTM1 GSTM1_HUMAN GSTM1b-1b Glutathione S-transferase Mu 1 glutathione S-transferase
Type:
PROTEIN
Mol. Mass.:
25712.03
Organism:
Homo sapiens (Human)
Description:
ChEMBL_799596
Residue:
218
  
Inhibitor
Name:
BDBM50043760
Synonyms:
2-Amino-4-[1-[(carboxy-phenyl-methyl)-carbamoyl]-2-(4-chloro-benzylsulfanyl)-ethylcarbamoyl]-butyric acid | CHEMBL442360
Type:
Small organic molecule
Emp. Form.:
C23H26ClN3O6S
Mol. Mass.:
507.987
SMILES:
NC(CCC(=O)NC(CSCc1ccc(Cl)cc1)C(=O)NC(C(O)=O)c1ccccc1)C(O)=O
: