Target
Polyunsaturated fatty acid 5-lipoxygenase
Ligand
BDBM50012896
Substrate
Meas. Tech.
ChEMBL_3972 (CHEMBL618070)
IC50
24000±n/a nM
Citation
 Unangst, PCConnor, DTCetenko, WASorenson, RJKostlan, CRSircar, JCWright, CDSchrier, DJDyer, RD Synthesis and biological evaluation of 5-[[3,5-bis(1,1-dimethylethyl)- 4-hydroxyphenyl]methylene]oxazoles, -thiazoles, and -imidazoles: novel dual 5-lipoxygenase and cyclooxygenase inhibitors with antiinflammatory activity. J Med Chem 37:322-8 (1994)  
Target
Name:
Polyunsaturated fatty acid 5-lipoxygenase
Synonyms:
Alox5 LOX5_RAT
Type:
PROTEIN
Mol. Mass.:
78082.31
Organism:
Rattus norvegicus
Description:
ChEMBL_1432947
Residue:
673
  
Inhibitor
Name:
BDBM50012896
Synonyms:
CHEMBL876 MECLOFENAMATE SODIUM Meclomen Sodium; 2-(2,6-dichloro-3-methyl-phenylamino)-benzoate(Fenamate series)
Type:
Small organic molecule
Emp. Form.:
C14H10Cl2NO2
Mol. Mass.:
295.141
SMILES:
Cc1ccc(Cl)c(Nc2ccccc2C([O-])=O)c1Cl
: