Target
Endothelin-1 receptor
Ligand
BDBM50034435
Substrate
Meas. Tech.
ChEMBL_65827 (CHEMBL682960)
IC50
570±n/a nM
Citation
 Stein, PDHunt, JTFloyd, DMMoreland, SDickinson, KEMitchell, CLiu, ECWebb, MLMurugesan, NDickey, J The discovery of sulfonamide endothelin antagonists and the development of the orally active ETA antagonist 5-(dimethylamino)-N-(3,4-dimethyl-5-isoxazolyl)-1-naphthalenesulf onamide. J Med Chem 37:329-31 (1994)  
Target
Name:
Endothelin-1 receptor
Synonyms:
EDNRA ET-A ETA-R Endothelin receptor type A hET-AR
Type:
Enzyme Catalytic Domain
Mol. Mass.:
48736.88
Organism:
Homo sapiens (Human)
Description:
P25101
Residue:
427
  
Inhibitor
Name:
BDBM50034435
Synonyms:
5-Dimethylamino-naphthalene-1-sulfonic acid (3,4-dimethyl-2,3-dihydro-oxazol-5-yl)-amide 5-Dimethylamino-naphthalene-1-sulfonic acid (3,4-dimethyl-isoxazol-5-yl)-amide (BMS 182874) CHEMBL267458
Type:
Small organic molecule
Emp. Form.:
C17H19N3O3S
Mol. Mass.:
345.416
SMILES:
CN(C)c1cccc2c(cccc12)S(=O)(=O)Nc1onc(C)c1C
: