Target
Endothelin-1 receptor
Ligand
BDBM50034441
Substrate
Meas. Tech.
ChEMBL_65826 (CHEMBL877809)
IC50
13000±n/a nM
Citation
 Stein, PDHunt, JTFloyd, DMMoreland, SDickinson, KEMitchell, CLiu, ECWebb, MLMurugesan, NDickey, J The discovery of sulfonamide endothelin antagonists and the development of the orally active ETA antagonist 5-(dimethylamino)-N-(3,4-dimethyl-5-isoxazolyl)-1-naphthalenesulf onamide. J Med Chem 37:329-31 (1994)  
Target
Name:
Endothelin-1 receptor
Synonyms:
EDNRA ET-A ETA-R Endothelin receptor type A hET-AR
Type:
Enzyme Catalytic Domain
Mol. Mass.:
48736.88
Organism:
Homo sapiens (Human)
Description:
P25101
Residue:
427
  
Inhibitor
Name:
BDBM50034441
Synonyms:
5-(3,4-Dimethyl-isoxazol-5-ylsulfamoyl)-naphthalene-1-carboxylic acid | CHEMBL30246
Type:
Small organic molecule
Emp. Form.:
C16H14N2O5S
Mol. Mass.:
346.358
SMILES:
Cc1noc(NS(=O)(=O)c2cccc3c(cccc23)C(O)=O)c1C
: