Target
D(2) dopamine receptor
Ligand
BDBM50035329
Substrate
Meas. Tech.
ChEBML_62872
Ki
156±n/a nM
Citation
 Stjernlöf, PGullme, MElebring, TAndersson, BWikström, HLagerquist, SSvensson, KEkman, ACarlsson, ASundell, S (S)- and (R)-8-(di-n-propylamino)-6,7,8,9-tetrahydro-3H-benz[e]indole-1- carbaldehyde: a new class of orally active 5-HT1A-receptor agonists. J Med Chem 36:2059-65 (1993)  
Target
Name:
D(2) dopamine receptor
Synonyms:
DOPAMINE D2 DOPAMINE D2 Short Dopamine D2 receptor Drd2
Type:
G Protein-Coupled Receptor (GPCR)
Mol. Mass.:
50931.60
Organism:
Rattus norvegicus (rat)
Description:
P61169
Residue:
444
  
Inhibitor
Name:
BDBM50035329
Synonyms:
(+/-)-Dipropyl-(6,7,8,9-tetrahydro-3H-benzo[e]indol-8-yl)-amine Dipropyl-(6,7,8,9-tetrahydro-3H-benzo[e]indol-8-yl)-amine
Type:
Small organic molecule
Emp. Form.:
C18H26N2
Mol. Mass.:
270.4124
SMILES:
CCCN(CCC)C1CCc2ccc3[nH]ccc3c2C1
: