Target
Dihydrofolate reductase
Ligand
BDBM50044419
Substrate
Meas. Tech.
ChEBML_54602
Ki
>1.000±n/a nM
Citation
 DeGraw, JIColwell, WTPiper, JRSirotnak, FM Synthesis and antitumor activity of 10-propargyl-10-deazaaminopterin. J Med Chem 36:2228-31 (1993)  
Target
Name:
Dihydrofolate reductase
Synonyms:
DYR_MOUSE | Dhfr
Type:
Enzyme
Mol. Mass.:
21608.82
Organism:
Mus musculus (Mouse)
Description:
Residue:
187
  
Inhibitor
Name:
BDBM50044419
Synonyms:
2-{4-[1-(2,4-Diamino-pteridin-6-ylmethyl)-hexyl]-benzoylamino}-pentanedioic acid | CHEMBL72283
Type:
Small organic molecule
Emp. Form.:
C25H31N7O5
Mol. Mass.:
509.5575
SMILES:
CCCCCC(Cc1cnc2nc(N)nc(N)c2n1)c1ccc(cc1)C(=O)NC(CCC(O)=O)C(O)=O
: