Target
Aromatase
Ligand
BDBM50044424
Substrate
Meas. Tech.
ChEBML_51346
Ki
7.6±n/a nM
Citation
 Walker, KAKertesz, DJRotstein, DMSwinney, DCBerry, PWSo, OYWebb, ASWatson, DMMak, AYBurton, PM Selective inhibition of mammalian lanosterol 14 alpha-demethylase: a possible strategy for cholesterol lowering. J Med Chem 36:2235-7 (1993)  
Target
Name:
Aromatase
Synonyms:
ARO1 CP19A_HUMAN CYP19 CYPXIX Cytochrome P450 19A1 Cytochrome P450-C19 (CYP19) FL cytokine receptor precursor | P-450AROM
Type:
Enzyme
Mol. Mass.:
57888.92
Organism:
Homo sapiens (Human)
Description:
P11511
Residue:
503
  
Inhibitor
Name:
BDBM50044424
Synonyms:
4-(((2S,4S)-2-((1H-imidazol-1-yl)methyl)-2-(4-chlorophenethyl)-1,3-dioxolan-4-yl)methylthio)benzenamine 4-{2-[2-(4-Chloro-phenyl)-ethyl]-2-imidazol-1-ylmethyl-[1,3]dioxolan-4-ylmethylsulfanyl}-phenylamine CHEMBL70611
Type:
Small organic molecule
Emp. Form.:
C22H24ClN3O2S
Mol. Mass.:
429.963
SMILES:
Nc1ccc(SC[C@@H]2CO[C@](CCc3ccc(Cl)cc3)(Cn3ccnc3)O2)cc1
: