Target
Cytochrome P450 11B1, mitochondrial
Ligand
BDBM50044425
Substrate
Meas. Tech.
ChEMBL_217359 (CHEMBL822873)
Ki
15±n/a nM
Citation
 Walker, KAKertesz, DJRotstein, DMSwinney, DCBerry, PWSo, OYWebb, ASWatson, DMMak, AYBurton, PM Selective inhibition of mammalian lanosterol 14 alpha-demethylase: a possible strategy for cholesterol lowering. J Med Chem 36:2235-7 (1993)  
Target
Name:
Cytochrome P450 11B1, mitochondrial
Synonyms:
C11B1_HUMAN CYPXIB1 Cytochrome P450 11B1 Cytochrome P450 11B1, mitochondrial | S11BH
Type:
Enzyme
Mol. Mass.:
57591.44
Organism:
Homo sapiens (Human)
Description:
P15538
Residue:
503
  
Inhibitor
Name:
BDBM50044425
Synonyms:
4-{(2R,4R)-2-[2-(4-Chloro-phenyl)-ethyl]-2-imidazol-1-ylmethyl-[1,3]dioxolan-4-ylmethylsulfanyl}-phenylamine CHEMBL305220
Type:
Small organic molecule
Emp. Form.:
C22H24ClN3O2S
Mol. Mass.:
429.963
SMILES:
Nc1ccc(SC[C@H]2CO[C@@](CCc3ccc(Cl)cc3)(Cn3ccnc3)O2)cc1
: