Target
Neprilysin
Ligand
BDBM50044868
Substrate
Meas. Tech.
ChEBML_144621
Ki
>10000±n/a nM
Citation
 Flynn, GABeight, DWMehdi, SKoehl, JRGiroux, ELFrench, JFHake, PWDage, RC Application of a conformationally restricted Phe-Leu dipeptide mimetic to the design of a combined inhibitor of angiotensin I-converting enzyme and neutral endopeptidase 24.11. J Med Chem 36:2420-3 (1993)  
Target
Name:
Neprilysin
Synonyms:
Mme Neprilysin Neutral endopeptidase 24.11
Type:
Protein
Mol. Mass.:
85789.59
Organism:
Rattus norvegicus (Rat)
Description:
P07861
Residue:
750
  
Inhibitor
Name:
BDBM50044868
Synonyms:
7-(1-Carboxy-3-phenyl-propylamino)-6-oxo-1,2,3,4,6,7,8,12b-octahydro-benzo[c]pyrido[1,2-a]azepine-4-carboxylic acid | CHEMBL309424
Type:
Small organic molecule
Emp. Form.:
C25H28N2O5
Mol. Mass.:
436.5002
SMILES:
OC(=O)[C@H](CCc1ccccc1)N[C@@H]1Cc2ccccc2C2CCC[C@@H](N2C1=O)C(O)=O
: