Target
Sensory histidine kinase DcuS
Ligand
BDBM50497021
Substrate
Meas. Tech.
ChEMBL_1335394 (CHEMBL3239045)
Kd
2000±n/a nM
Citation
 Murray, EJCrowley, RCTruman, AClarke, SRCottam, JAJadhav, GPSteele, VRO'Shea, PLindholm, CCockayne, AChhabra, SRChan, WCWilliams, P Targeting Staphylococcus aureus quorum sensing with nonpeptidic small molecule inhibitors. J Med Chem 57:2813-9 (2014)  
Target
Name:
Sensory histidine kinase DcuS
Synonyms:
Receptor-histidine kinase AgrC
Type:
PROTEIN
Mol. Mass.:
49890.25
Organism:
Staphylococcus aureus
Description:
ChEMBL_305973
Residue:
430
  
Inhibitor
Name:
BDBM50497021
Synonyms:
CHEMBL3235597
Type:
Small organic molecule
Emp. Form.:
C20H35NO4
Mol. Mass.:
353.4962
SMILES:
CCCCCCCCCCCCC\C(O)=C1\C(=O)N[C@@H](CCO)C1=O
: