Target
Mu-type opioid receptor
Ligand
BDBM50456334
Substrate
Meas. Tech.
ChEMBL_221917 (CHEMBL842482)
IC50
557±n/a nM
Citation
 Yamazaki, TRo, SGoodman, MChung, NNSchiller, PW A topochemical approach to explain morphiceptin bioactivity. J Med Chem 36:708-19 (1993)  
Target
Name:
Mu-type opioid receptor
Synonyms:
M-OR-1 Mu opioid receptor OPIATE Mu OPRM_CAVPO
Type:
Enzyme Catalytic Domain
Mol. Mass.:
11165.58
Organism:
GUINEA PIG
Description:
P97266
Residue:
98
  
Inhibitor
Name:
BDBM50456334
Synonyms:
CHEMBL2371340
Type:
Small organic molecule
Emp. Form.:
C28H35N5O5
Mol. Mass.:
521.608
SMILES:
N[C@@H](Cc1ccc(O)cc1)C(=O)N1CCC[C@H]1C(=O)N[C@H](Cc1ccccc1)C(=O)N1CCC[C@@H]1C(N)=O
: