Target
Pepsin A-5
Ligand
BDBM50045291
Substrate
Meas. Tech.
ChEBML_153845
Ki
1240±n/a nM
Citation
 Rao, CMScarborough, PEKay, JBatley, BRapundalo, SKlutchko, STaylor, MDLunney, EAHumblet, CCDunn, BM Specificity in the binding of inhibitors to the active site of human/primate aspartic proteinases: analysis of P2-P1-P1'-P2' variation. J Med Chem 36:2614-20 (1993)  
Target
Name:
Pepsin A-5
Synonyms:
PEPA5_HUMAN Pepsin A | Pepsinogen A5
Type:
PROTEIN
Mol. Mass.:
41971.56
Organism:
Homo sapiens (Human)
Description:
ChEMBL_1452206
Residue:
388
  
Inhibitor
Name:
BDBM50045291
Synonyms:
CHEMBL88340 | i2-[2-(Morpholine-4-sulfonylamino)-3-phenyl-propionylamino]-pent-4-enoic acid [1-cyclohexylmethyl-3,3-difluoro-2-hydroxy-3-(2-morpholin-4-yl-ethylcarbamoyl)-propyl]-amide
Type:
Small organic molecule
Emp. Form.:
C35H54F2N6O8S
Mol. Mass.:
756.9
SMILES:
O[C@H]([C@H](CC1CCCCC1)NC(=O)[C@H](CC=C)NC(=O)[C@H](Cc1ccccc1)NS(=O)(=O)N1CCOCC1)C(F)(F)C(=O)NCCN1CCOCC1
: