Target
Cathepsin E
Ligand
BDBM50045280
Substrate
Meas. Tech.
ChEBML_45334
Ki
300±n/a nM
Citation
 Rao, CMScarborough, PEKay, JBatley, BRapundalo, SKlutchko, STaylor, MDLunney, EAHumblet, CCDunn, BM Specificity in the binding of inhibitors to the active site of human/primate aspartic proteinases: analysis of P2-P1-P1'-P2' variation. J Med Chem 36:2614-20 (1993)  
Target
Name:
Cathepsin E
Synonyms:
3.4.23.34 CTSE Cathepsin E form II
Type:
Enzyme
Mol. Mass.:
43298.99
Organism:
Homo sapiens (Human)
Description:
P14091
Residue:
396
  
Inhibitor
Name:
BDBM50045280
Synonyms:
CHEMBL88654 | N-[2-(5-Amino-thiophen-3-yl)-1-(1-cyclohexylmethyl-2,4-dihydroxy-hexylcarbamoyl)-ethyl]-2-(morpholine-4-sulfonylamino)-3-phenyl-propionamide
Type:
Small organic molecule
Emp. Form.:
C33H51N5O7S2
Mol. Mass.:
693.917
SMILES:
CC[C@@H](O)C[C@H](O)[C@H](CC1CCCCC1)NC(=O)[C@H](Cc1csc(N)c1)NC(=O)[C@H](Cc1ccccc1)NS(=O)(=O)N1CCOCC1
: