Target
Gastricsin
Ligand
BDBM50045293
Substrate
Meas. Tech.
ChEBML_71514
Ki
>4000±n/a nM
Citation
 Rao, CMScarborough, PEKay, JBatley, BRapundalo, SKlutchko, STaylor, MDLunney, EAHumblet, CCDunn, BM Specificity in the binding of inhibitors to the active site of human/primate aspartic proteinases: analysis of P2-P1-P1'-P2' variation. J Med Chem 36:2614-20 (1993)  
Target
Name:
Gastricsin
Synonyms:
Gastricsin PGC | Pepsinogen C
Type:
PROTEIN
Mol. Mass.:
42409.17
Organism:
Homo sapiens (Human)
Description:
ChEMBL_1452207
Residue:
388
  
Inhibitor
Name:
BDBM50045293
Synonyms:
CHEMBL90683 | N-[(1-Cyclohexylmethyl-2,4-dihydroxy-hexylcarbamoyl)-methyl]-2-(morpholine-4-sulfonylamino)-3-phenyl-propionamide
Type:
Small organic molecule
Emp. Form.:
C28H46N4O7S
Mol. Mass.:
582.752
SMILES:
CC[C@@H](O)C[C@H](O)[C@H](CC1CCCCC1)NC(=O)CNC(=O)[C@H](Cc1ccccc1)NS(=O)(=O)N1CCOCC1
: