Target
Renin
Ligand
BDBM50045292
Substrate
Meas. Tech.
ChEBML_192726
IC50
0.200000±n/a nM
Citation
 Rao, CMScarborough, PEKay, JBatley, BRapundalo, SKlutchko, STaylor, MDLunney, EAHumblet, CCDunn, BM Specificity in the binding of inhibitors to the active site of human/primate aspartic proteinases: analysis of P2-P1-P1'-P2' variation. J Med Chem 36:2614-20 (1993)  
Target
Name:
Renin
Synonyms:
Angiotensinogenase RENI_HUMAN
Type:
Enzyme
Mol. Mass.:
45058.99
Organism:
Homo sapiens (Human)
Description:
Residue:
406
  
Inhibitor
Name:
BDBM50045292
Synonyms:
(S)-2-[(S)-2-(Morpholine-4-sulfonylamino)-3-phenyl-propionylamino]-pent-4-enoic acid ((1S,2R,3S)-1-cyclohexylmethyl-2,3-dihydroxy-5-methyl-hexyl)-amide CHEMBL62380
Type:
Small organic molecule
Emp. Form.:
C32H52N4O7S
Mol. Mass.:
636.843
SMILES:
CC(C)C[C@H](O)[C@H](O)[C@H](CC1CCCCC1)NC(=O)[C@H](CC=C)NC(=O)[C@H](Cc1ccccc1)NS(=O)(=O)N1CCOCC1
: