Target
Adenosine receptor A2a
Ligand
BDBM50045352
Substrate
Meas. Tech.
ChEBML_29991
Ki
12000±n/a nM
Citation
 Jacobson, KAShi, DGallo-Rodriguez, CManning, MMüller, CDaly, JWNeumeyer, JLKiriasis, LPfleiderer, W Effect of trifluoromethyl and other substituents on activity of xanthines at adenosine receptors. J Med Chem 36:2639-44 (1993)  
Target
Name:
Adenosine receptor A2a
Synonyms:
AA2AR_RAT Adenosine A2 receptor Adenosine Receptors A2a (A2a) Adenosine receptors A2a Rat striatal adenosine A2a receptor
Type:
G Protein-Coupled Receptor (GPCR)
Mol. Mass.:
45015.65
Organism:
Rattus norvegicus (rat)
Description:
Rat A2A receptors expressed in CHO cells.
Residue:
410
  
Inhibitor
Name:
BDBM50045352
Synonyms:
3,7-Dimethyl-8-phenyl-3,7-dihydro-purine-2,6-dione | CHEMBL327584
Type:
Small organic molecule
Emp. Form.:
C13H12N4O2
Mol. Mass.:
256.26
SMILES:
Cn1c(nc2n(C)c(=O)[nH]c(=O)c12)-c1ccccc1
: