Target
Leukotriene B4 receptor 1
Ligand
BDBM50001611
Substrate
Meas. Tech.
ChEMBL_99663 (CHEMBL704429)
IC50
12±n/a nM
Citation
 Daines, RAChambers, PAPendrak, IJakas, DRSarau, HMFoley, JJSchmidt, DBGriswold, DEMartin, LDTzimas, MN (E)-3-[[[[6-(2-carboxyethenyl)-5-[[8-(4- methoxyphenyl)octyl]oxy]-2-pyridinyl]-methyl]thio]methyl]benzoic acid: a novel high-affinity leukotriene B4 receptor antagonist. J Med Chem 36:2703-5 (1993)  
Target
Name:
Leukotriene B4 receptor 1
Synonyms:
BLT BLTR Chemoattractant receptor-like 1 GPR16 LTB4-R 1 Leukotriene B4 R1 Leukotriene B4 receptor 1 P2Y purinoceptor 7 | P2Y7
Type:
Enzyme Catalytic Domain
Mol. Mass.:
37582.68
Organism:
Homo sapiens (Human)
Description:
Q15722
Residue:
352
  
Inhibitor
Name:
BDBM50001611
Synonyms:
(E)-3-{3-(2-Carboxy-ethyl)-4-[6-(4-methoxy-phenyl)-hex-5-enyloxy]-benzoyl}-benzoic acid 3-{3-(2-Carboxy-ethyl)-4-[(E)-6-(4-methoxy-phenyl)-hex-5-enyloxy]-benzoyl}-benzoic acid 3-{3-(2-Carboxy-ethyl)-4-[6-(4-methoxy-phenyl)-hex-5-enyloxy]-benzoyl}-benzoic acid (BT223982) CHEMBL49302 | LY-223982
Type:
Small organic molecule
Emp. Form.:
C30H30O7
Mol. Mass.:
502.555
SMILES:
COc1ccc(\C=C\CCCCOc2ccc(cc2CCC(O)=O)C(=O)c2cccc(c2)C(O)=O)cc1
: