Target
5-hydroxytryptamine receptor 1A
Ligand
BDBM50005123
Substrate
Meas. Tech.
ChEBML_1193
Ki
122±n/a nM
Citation
 van Steen, BJvan Wijngaarden, ITulp, MTSoudijn, W Structure-affinity relationship studies on 5-HT1A receptor ligands. 1. Heterobicyclic phenylpiperazines with N4-alkyl substituents. J Med Chem 36:2751-60 (1993)  
Target
Name:
5-hydroxytryptamine receptor 1A
Synonyms:
5-HT-1A 5-HT1A 5-hydroxytryptamine receptor 1A (5HT1A) 5ht1a Htr1a Serotonin 1a (5-HT1a) receptor/Adrenergic receptor alpha-1 | Serotonin receptor 1A
Type:
G Protein-Coupled Receptor (GPCR)
Mol. Mass.:
46445.29
Organism:
Rattus norvegicus (rat)
Description:
Binding assays were performed using rat hippocampal membranes.
Residue:
422
  
Inhibitor
Name:
BDBM50005123
Synonyms:
1-(3-Chloro-phenyl)-4-propyl-piperazine CHEMBL27192
Type:
Small organic molecule
Emp. Form.:
C13H19ClN2
Mol. Mass.:
238.756
SMILES:
CCCN1CCN(CC1)c1cccc(Cl)c1
: