Target
Polyunsaturated fatty acid 5-lipoxygenase
Ligand
BDBM50045673
Substrate
Meas. Tech.
ChEBML_4181
IC50
16±n/a nM
Citation
 Hutchinson, JHRiendeau, DBrideau, CChan, CDelorme, DDenis, DFalgueyret, JPFortin, RGuay, JHamel, P Substituted thiopyrano[2,3,4-c,d]indoles as potent, selective, and orally active inhibitors of 5-lipoxygenase. Synthesis and biological evaluation of L-691,816. J Med Chem 36:2771-87 (1993)  
Target
Name:
Polyunsaturated fatty acid 5-lipoxygenase
Synonyms:
Alox5 LOX5_RAT
Type:
PROTEIN
Mol. Mass.:
78082.31
Organism:
Rattus norvegicus
Description:
ChEMBL_1432947
Residue:
673
  
Inhibitor
Name:
BDBM50045673
Synonyms:
1-(4-Chloro-benzyl)-2-[2,2-dimethyl-3-(1H-tetrazol-5-yl)-propyl]-4-methyl-6-[2-(5-phenyl-pyridin-2-yl)-ethyl]-4,5-dihydro-1H-3-thia-1-aza-acenaphthylene | CHEMBL81812
Type:
Small organic molecule
Emp. Form.:
C37H37ClN6S
Mol. Mass.:
633.248
SMILES:
CC1Cc2c(CCc3ccc(cn3)-c3ccccc3)ccc3n(Cc4ccc(Cl)cc4)c(CC(C)(C)Cc4nnn[nH]4)c(S1)c23
: