Target
Mu-type opioid receptor
Ligand
BDBM50045760
Substrate
Meas. Tech.
ChEMBL_222070 (CHEMBL843461)
Ki
82±n/a nM
Citation
 Zimmerman, DMLeander, JDCantrell, BEReel, JKSnoddy, JMendelsohn, LGJohnson, BGMitch, CH Structure-activity relationships of trans-3,4-dimethyl-4-(3-hydroxyphenyl)piperidine antagonists for mu- and kappa-opioid receptors. J Med Chem 36:2833-41 (1993)  
Target
Name:
Mu-type opioid receptor
Synonyms:
MOR-1 Mu-type opioid receptor (MOR) OPRM_RAT Opioid receptor B Ror-b
Type:
G Protein-Coupled Receptor (GPCR)
Mol. Mass.:
44503.11
Organism:
Rattus norvegicus (rat)
Description:
Competition binding assays were carried out using membrane preparations from transfected HN9.10 cells that constitutively expressed the mu opioid receptor.
Residue:
398
  
Inhibitor
Name:
BDBM50045760
Synonyms:
3-(1-Furan-3-ylmethyl-3,4-dimethyl-piperidin-4-yl)-phenol | CHEMBL94856
Type:
Small organic molecule
Emp. Form.:
C18H23NO2
Mol. Mass.:
285.3807
SMILES:
C[C@H]1CN(Cc2ccoc2)CC[C@@]1(C)c1cccc(O)c1
: