Target
Kappa-type opioid receptor
Ligand
BDBM50045738
Substrate
Meas. Tech.
ChEMBL_220933 (CHEMBL824000)
Ki
9.6±n/a nM
Citation
 Zimmerman, DMLeander, JDCantrell, BEReel, JKSnoddy, JMendelsohn, LGJohnson, BGMitch, CH Structure-activity relationships of trans-3,4-dimethyl-4-(3-hydroxyphenyl)piperidine antagonists for mu- and kappa-opioid receptors. J Med Chem 36:2833-41 (1993)  
Target
Name:
Kappa-type opioid receptor
Synonyms:
Kappa Opioid Receptor OPRK1 Opiate Kappa 1 | mu/kappa opioid receptor
Type:
G Protein-Coupled Receptor (GPCR)
Mol. Mass.:
42744.99
Organism:
Cavia porcellus (domestic guinea pig)
Description:
P41144
Residue:
380
  
Inhibitor
Name:
BDBM50045738
Synonyms:
(3R,4R)3-(1-Hexyl-3,4-dimethyl-piperidin-4-yl)-phenol CHEMBL96058
Type:
Small organic molecule
Emp. Form.:
C19H31NO
Mol. Mass.:
289.4555
SMILES:
CCCCCCN1CC[C@](C)([C@@H](C)C1)c1cccc(O)c1
: