Target
Mu-type opioid receptor
Ligand
BDBM50045774
Substrate
Meas. Tech.
ChEMBL_222070 (CHEMBL843461)
Ki
50±n/a nM
Citation
 Zimmerman, DMLeander, JDCantrell, BEReel, JKSnoddy, JMendelsohn, LGJohnson, BGMitch, CH Structure-activity relationships of trans-3,4-dimethyl-4-(3-hydroxyphenyl)piperidine antagonists for mu- and kappa-opioid receptors. J Med Chem 36:2833-41 (1993)  
Target
Name:
Mu-type opioid receptor
Synonyms:
MOR-1 Mu-type opioid receptor (MOR) OPRM_RAT Opioid receptor B Ror-b
Type:
G Protein-Coupled Receptor (GPCR)
Mol. Mass.:
44503.11
Organism:
Rattus norvegicus (rat)
Description:
Competition binding assays were carried out using membrane preparations from transfected HN9.10 cells that constitutively expressed the mu opioid receptor.
Residue:
398
  
Inhibitor
Name:
BDBM50045774
Synonyms:
3-{1-[2-(3,4-Dichloro-phenyl)-ethyl]-3,4-dimethyl-piperidin-4-yl}-phenol | CHEMBL439586
Type:
Small organic molecule
Emp. Form.:
C21H25Cl2NO
Mol. Mass.:
378.335
SMILES:
C[C@H]1CN(CCc2ccc(Cl)c(Cl)c2)CC[C@@]1(C)c1cccc(O)c1
: