Target
Kappa-type opioid receptor
Ligand
BDBM50045734
Substrate
Meas. Tech.
ChEMBL_220934 (CHEMBL824001)
Ki
7.5±n/a nM
Citation
 Zimmerman, DMLeander, JDCantrell, BEReel, JKSnoddy, JMendelsohn, LGJohnson, BGMitch, CH Structure-activity relationships of trans-3,4-dimethyl-4-(3-hydroxyphenyl)piperidine antagonists for mu- and kappa-opioid receptors. J Med Chem 36:2833-41 (1993)  
Target
Name:
Kappa-type opioid receptor
Synonyms:
Kappa Opioid Receptor OPRK1 Opiate Kappa 1 | mu/kappa opioid receptor
Type:
G Protein-Coupled Receptor (GPCR)
Mol. Mass.:
42744.99
Organism:
Cavia porcellus (domestic guinea pig)
Description:
P41144
Residue:
380
  
Inhibitor
Name:
BDBM50045734
Synonyms:
3-[3,4-Dimethyl-1-(2-o-tolyl-ethyl)-piperidin-4-yl]-phenol | CHEMBL95050
Type:
Small organic molecule
Emp. Form.:
C22H29NO
Mol. Mass.:
323.4718
SMILES:
C[C@H]1CN(CCc2ccccc2C)CC[C@@]1(C)c1cccc(O)c1
: