Target
Mu-type opioid receptor
Ligand
BDBM50045738
Substrate
Meas. Tech.
ChEBML_222070
Ki
0.290000±n/a nM
Citation
 Zimmerman, DMLeander, JDCantrell, BEReel, JKSnoddy, JMendelsohn, LGJohnson, BGMitch, CH Structure-activity relationships of trans-3,4-dimethyl-4-(3-hydroxyphenyl)piperidine antagonists for mu- and kappa-opioid receptors. J Med Chem 36:2833-41 (1993)  
Target
Name:
Mu-type opioid receptor
Synonyms:
MOR-1 Mu-type opioid receptor (MOR) OPRM_RAT Opioid receptor B Ror-b
Type:
G Protein-Coupled Receptor (GPCR)
Mol. Mass.:
44503.11
Organism:
Rattus norvegicus (rat)
Description:
Competition binding assays were carried out using membrane preparations from transfected HN9.10 cells that constitutively expressed the mu opioid receptor.
Residue:
398
  
Inhibitor
Name:
BDBM50045738
Synonyms:
(3R,4R)3-(1-Hexyl-3,4-dimethyl-piperidin-4-yl)-phenol CHEMBL96058
Type:
Small organic molecule
Emp. Form.:
C19H31NO
Mol. Mass.:
289.4555
SMILES:
CCCCCCN1CC[C@](C)([C@@H](C)C1)c1cccc(O)c1
: