Target
Mu-type opioid receptor
Ligand
BDBM50045767
Substrate
Meas. Tech.
ChEBML_222070
Ki
1.5±n/a nM
Citation
 Zimmerman, DMLeander, JDCantrell, BEReel, JKSnoddy, JMendelsohn, LGJohnson, BGMitch, CH Structure-activity relationships of trans-3,4-dimethyl-4-(3-hydroxyphenyl)piperidine antagonists for mu- and kappa-opioid receptors. J Med Chem 36:2833-41 (1993)  
Target
Name:
Mu-type opioid receptor
Synonyms:
MOR-1 Mu-type opioid receptor (MOR) OPRM_RAT Opioid receptor B Ror-b
Type:
G Protein-Coupled Receptor (GPCR)
Mol. Mass.:
44503.11
Organism:
Rattus norvegicus (rat)
Description:
Competition binding assays were carried out using membrane preparations from transfected HN9.10 cells that constitutively expressed the mu opioid receptor.
Residue:
398
  
Inhibitor
Name:
BDBM50045767
Synonyms:
(+)-N-phenethyl trans-3(R),4(R)-dimethyl-4-(3-hydroxyphenyl)piperidine 3-(3,4-Dimethyl-1-phenethyl-piperidin-4-yl)-phenol CHEMBL319536 | N-phenethyltrans-3,4-dimethyl-4-(3-hydroxyphenyl)piperidine
Type:
Small organic molecule
Emp. Form.:
C21H27NO
Mol. Mass.:
309.4452
SMILES:
C[C@H]1CN(CCc2ccccc2)CC[C@@]1(C)c1cccc(O)c1
: