Target
Kappa-type opioid receptor
Ligand
BDBM50045789
Substrate
Meas. Tech.
ChEBML_220942
Ki
3±n/a nM
Citation
 Mitch, CHLeander, JDMendelsohn, LGShaw, WNWong, DTCantrell, BEJohnson, BGReel, JKSnoddy, JDTakemori, AE 3,4-Dimethyl-4-(3-hydroxyphenyl)piperidines: opioid antagonists with potent anorectant activity. J Med Chem 36:2842-50 (1993)  
Target
Name:
Kappa-type opioid receptor
Synonyms:
Kappa Opioid Receptor OPRK1 Opiate Kappa 1 | mu/kappa opioid receptor
Type:
G Protein-Coupled Receptor (GPCR)
Mol. Mass.:
42744.99
Organism:
Cavia porcellus (domestic guinea pig)
Description:
P41144
Residue:
380
  
Inhibitor
Name:
BDBM50045789
Synonyms:
3-[3,4-Dimethyl-1-(5-methyl-hexyl)-piperidin-4-yl]-phenol | CHEMBL95343
Type:
Small organic molecule
Emp. Form.:
C20H33NO
Mol. Mass.:
303.4821
SMILES:
CC(C)CCCCN1CC[C@@](C)([C@H](C)C1)c1cccc(O)c1
: