Target
Kappa-type opioid receptor
Ligand
BDBM50045738
Substrate
Meas. Tech.
ChEBML_220942
Ki
5.2±n/a nM
Citation
 Mitch, CHLeander, JDMendelsohn, LGShaw, WNWong, DTCantrell, BEJohnson, BGReel, JKSnoddy, JDTakemori, AE 3,4-Dimethyl-4-(3-hydroxyphenyl)piperidines: opioid antagonists with potent anorectant activity. J Med Chem 36:2842-50 (1993)  
Target
Name:
Kappa-type opioid receptor
Synonyms:
Kappa Opioid Receptor OPRK1 Opiate Kappa 1 | mu/kappa opioid receptor
Type:
G Protein-Coupled Receptor (GPCR)
Mol. Mass.:
42744.99
Organism:
Cavia porcellus (domestic guinea pig)
Description:
P41144
Residue:
380
  
Inhibitor
Name:
BDBM50045738
Synonyms:
(3R,4R)3-(1-Hexyl-3,4-dimethyl-piperidin-4-yl)-phenol CHEMBL96058
Type:
Small organic molecule
Emp. Form.:
C19H31NO
Mol. Mass.:
289.4555
SMILES:
CCCCCCN1CC[C@](C)([C@@H](C)C1)c1cccc(O)c1
: